Post Reply 
 
Thread Rating:
  • 0 Votes - 0 Average
  • 1
  • 2
  • 3
  • 4
  • 5
I can not compile from source since version 3.5.1 from svn
04-04-2011, 16:09
Post: #1
I can not compile from source since version 3.5.1 from svn
Quote:make[3]: *** No rule to make target `poly.o', needed by `sky'. Stop.
make[3]: *** Waiting for unfinished jobs....
mv -f .deps/list.Tpo .deps/list.Po
galaxies.c: In function ‘make_sersic’:
galaxies.c:372: warning: implicit declaration of function ‘sincosf’
galaxies.c:372: warning: incompatible implicit declaration of built-in function ‘sincosf’
galaxies.c: In function ‘make_galaxy’:
galaxies.c:78: warning: ‘n’ may be used uninitialized in this function
mv -f .deps/alterimage.Tpo .deps/alterimage.Po
mv -f .deps/galaxies.Tpo .deps/galaxies.Po
mv -f .deps/imaout.Tpo .deps/imaout.Po
mv -f .deps/main.Tpo .deps/main.Po
mv -f .deps/makeit.Tpo .deps/makeit.Po
make[3]: Leaving directory `/tmp/skymaker/src'
make[2]: *** [all-recursive] Error 1
make[2]: Leaving directory `/tmp/skymaker/src'
make[1]: *** [all-recursive] Error 1
make[1]: Leaving directory `/tmp/skymaker'
make: *** [all] Error 2

More detail in the attached files.


Attached File(s)
.txt  configure.txt (Size: 7.96 KB / Downloads: 1255)
.txt  compilation.txt (Size: 8.96 KB / Downloads: 1387)
Find all posts by this user
Quote this message in a reply
06-19-2011, 15:44
Post: #2
RE: I can not compile from source since version 3.5.1 from svn
Further investigation of the problem:
3412 alterimage.Po
3212 fft.Po
3446 galaxies.Po
3513 image.Po
2448 imaout.Po
2907 list.Po
2191 main.Po
2289 makeit.Po
8 poly.Po
8 prefs.Po
8 psf.Po
8 random.Po
8 simul.Po
8 stars.Po

All files lying after makeit.Po only contain the following entry:

cat poly.Po
# dummy
Find all posts by this user
Quote this message in a reply
07-25-2011, 09:56
Post: #3
RE: I can not compile from source since version 3.5.1 from svn
Hi bmv,

sorry for not replying earlier. There as indeed a missing test for the sincosf() function, which turns out not being supported on MacOS. It is now fixed on the SVN. A similar problem occured with SExtractor and it is now fixed as well.
Thanks for reporting this bug, and sorry again for not reacting earlier!
- Emmanuel.
Visit this user's website Find all posts by this user
Quote this message in a reply
02-20-2015, 08:23 (This post was last modified: 03-06-2015 12:11 by pasban7777.)
Post: #4
RE: I can not compile from source since version 3.5.1 from svn
sorry for not replying earlier. There as indeed a missing test for the sincosf() function, which turns out not being supported on MacOS. It is now fixed on the SVN. A similar problem occured with SExtractor and it is now fixed as well.
Thanks for reporting this bug, and sorry again for not reacting earlier!


___________

Decrease your exam stress by using our latest Pass4sure ccnp dumps and best quality vmware vcp VCP550 classes and pass guide. We provide with 100% pass guarantee along with and www.pittstate.edu
Find all posts by this user
Quote this message in a reply
Post Reply 


Forum Jump:


User(s) browsing this thread: 1 Guest(s)