AstrOmatic forum
I can not compile from source since version 3.5.1 from svn - Printable Version

+- AstrOmatic forum (https://www.astromatic.net/forum)
+-- Forum: AstrOmatic software (/forumdisplay.php?fid=3)
+--- Forum: SkyMaker (/forumdisplay.php?fid=19)
+--- Thread: I can not compile from source since version 3.5.1 from svn (/showthread.php?tid=647)



I can not compile from source since version 3.5.1 from svn - bmv - 04-04-2011 16:09

Quote:make[3]: *** No rule to make target `poly.o', needed by `sky'. Stop.
make[3]: *** Waiting for unfinished jobs....
mv -f .deps/list.Tpo .deps/list.Po
galaxies.c: In function ‘make_sersic’:
galaxies.c:372: warning: implicit declaration of function ‘sincosf’
galaxies.c:372: warning: incompatible implicit declaration of built-in function ‘sincosf’
galaxies.c: In function ‘make_galaxy’:
galaxies.c:78: warning: ‘n’ may be used uninitialized in this function
mv -f .deps/alterimage.Tpo .deps/alterimage.Po
mv -f .deps/galaxies.Tpo .deps/galaxies.Po
mv -f .deps/imaout.Tpo .deps/imaout.Po
mv -f .deps/main.Tpo .deps/main.Po
mv -f .deps/makeit.Tpo .deps/makeit.Po
make[3]: Leaving directory `/tmp/skymaker/src'
make[2]: *** [all-recursive] Error 1
make[2]: Leaving directory `/tmp/skymaker/src'
make[1]: *** [all-recursive] Error 1
make[1]: Leaving directory `/tmp/skymaker'
make: *** [all] Error 2

More detail in the attached files.


RE: I can not compile from source since version 3.5.1 from svn - bmv - 06-19-2011 15:44

Further investigation of the problem:
3412 alterimage.Po
3212 fft.Po
3446 galaxies.Po
3513 image.Po
2448 imaout.Po
2907 list.Po
2191 main.Po
2289 makeit.Po
8 poly.Po
8 prefs.Po
8 psf.Po
8 random.Po
8 simul.Po
8 stars.Po

All files lying after makeit.Po only contain the following entry:

cat poly.Po
# dummy


RE: I can not compile from source since version 3.5.1 from svn - Emmanuel Bertin - 07-25-2011 09:56

Hi bmv,

sorry for not replying earlier. There as indeed a missing test for the sincosf() function, which turns out not being supported on MacOS. It is now fixed on the SVN. A similar problem occured with SExtractor and it is now fixed as well.
Thanks for reporting this bug, and sorry again for not reacting earlier!
- Emmanuel.


RE: I can not compile from source since version 3.5.1 from svn - pasban7777 - 02-20-2015 08:23

sorry for not replying earlier. There as indeed a missing test for the sincosf() function, which turns out not being supported on MacOS. It is now fixed on the SVN. A similar problem occured with SExtractor and it is now fixed as well.
Thanks for reporting this bug, and sorry again for not reacting earlier!


___________

Decrease your exam stress by using our latest Pass4sure ccnp dumps and best quality vmware vcp VCP550 classes and pass guide. We provide with 100% pass guarantee along with and www.pittstate.edu